FailedConsole Output

Started by an SCM change
Running as SYSTEM
[EnvInject] - Loading node environment variables.
Building in workspace /var/lib/jenkins/workspace/development/alltest
No credentials specified
 > git rev-parse --is-inside-work-tree # timeout=10
Fetching changes from the remote Git repository
 > git config remote.origin.url https://github.com/JMRI/JMRI.git # timeout=10
Using shallow fetch with depth 50
Fetching upstream changes from https://github.com/JMRI/JMRI.git
 > git --version # timeout=10
 > git fetch --tags --progress --depth=50 -- https://github.com/JMRI/JMRI.git +refs/heads/master:refs/remotes/origin/master # timeout=30
 > git rev-parse refs/remotes/origin/master^{commit} # timeout=10
 > git rev-parse refs/remotes/origin/origin/master^{commit} # timeout=10
Checking out Revision 5a61da6f46a525ea4817c3ddd30e286799a63658 (refs/remotes/origin/master)
 > git config core.sparsecheckout # timeout=10
 > git checkout -f 5a61da6f46a525ea4817c3ddd30e286799a63658 # timeout=10
Commit message: "Merge pull request #9150 from jerryg2003/patch-3"
 > git rev-list --no-walk 4c80f34875e2509efbd2e45a265c322956424a62 # timeout=10
Xvfb starting$ Xvfb :0 -fbdir /var/lib/jenkins/xvfb-436-..fbdir11186566389353757169
[EnvInject] - Executing scripts and injecting environment variables after the SCM step.
[EnvInject] - Executing and processing the following script content: 
sed -i 's/timeout="7200000"/timeout="12000000"/' build.xml

[alltest] $ /bin/sh -xe /tmp/jenkins15638352044829497125.sh
+ sed -i s/timeout="7200000"/timeout="12000000"/ build.xml
[EnvInject] - Script executed successfully.
[alltest] $ /var/lib/jenkins/tools/hudson.tasks.Ant_AntInstallation/Ant_1.10.6/bin/ant realclean logalltest
Picked up JAVA_TOOL_OPTIONS: -Dfile.encoding=UTF-8
Buildfile: /var/lib/jenkins/workspace/development/alltest/build.xml

clean:
   [delete] Deleting directory /var/lib/jenkins/workspace/development/alltest/target
   [delete] Deleting directory /var/lib/jenkins/workspace/development/alltest/temp
   [delete] Deleting /var/lib/jenkins/workspace/development/alltest/tests.log
   [delete] Deleting /var/lib/jenkins/workspace/development/alltest/cucumber-results.xml

clean:

realclean:

init:
    [mkdir] Created dir: /var/lib/jenkins/workspace/development/alltest/target/classes
    [mkdir] Created dir: /var/lib/jenkins/workspace/development/alltest/target/classes/resources
    [mkdir] Created dir: /var/lib/jenkins/workspace/development/alltest/target/testreport

copyfiles:
     [copy] Copying 18 files to /var/lib/jenkins/workspace/development/alltest/target/classes/resources
     [copy] Copying 1884 files to /var/lib/jenkins/workspace/development/alltest/target/classes

jjtree:
    [mkdir] Created dir: /var/lib/jenkins/workspace/development/alltest/target/generated-sources/jjtree/jmri/jmris/srcp/parser
   [jjtree] Picked up JAVA_TOOL_OPTIONS: -Dfile.encoding=UTF-8
   [jjtree] Java Compiler Compiler Version 7.0.3 (Tree Builder)
   [jjtree] (type "jjtree" with no arguments for help)
   [jjtree] Reading from file /var/lib/jenkins/workspace/development/alltest/java/src/jmri/jmris/srcp/SRCPParser.jjt . . .
   [jjtree] opt:java
   [jjtree] File "Node.java" does not exist.  Will create one.
   [jjtree] File "SimpleNode.java" does not exist.  Will create one.
   [jjtree] File "ASThandshakecommand.java" does not exist.  Will create one.
   [jjtree] File "ASTcommand.java" does not exist.  Will create one.
   [jjtree] File "ASTserviceversion.java" does not exist.  Will create one.
   [jjtree] File "ASTconnectionmode.java" does not exist.  Will create one.
   [jjtree] File "ASTbus.java" does not exist.  Will create one.
   [jjtree] File "ASTaddress.java" does not exist.  Will create one.
   [jjtree] File "ASTvalue.java" does not exist.  Will create one.
   [jjtree] File "ASTcvno.java" does not exist.  Will create one.
   [jjtree] File "ASTzeroaddress.java" does not exist.  Will create one.
   [jjtree] File "ASTnonzeroaddress.java" does not exist.  Will create one.
   [jjtree] File "ASTport.java" does not exist.  Will create one.
   [jjtree] File "ASTdevicegroup.java" does not exist.  Will create one.
   [jjtree] File "ASTgo.java" does not exist.  Will create one.
   [jjtree] File "ASTget.java" does not exist.  Will create one.
   [jjtree] File "ASThandshake_set.java" does not exist.  Will create one.
   [jjtree] File "ASTprotocollitteral.java" does not exist.  Will create one.
   [jjtree] File "ASTconnectionlitteral.java" does not exist.  Will create one.
   [jjtree] File "ASTset.java" does not exist.  Will create one.
   [jjtree] File "ASTterm.java" does not exist.  Will create one.
   [jjtree] File "ASTcheck.java" does not exist.  Will create one.
   [jjtree] File "ASTwait_cmd.java" does not exist.  Will create one.
   [jjtree] File "ASTinit.java" does not exist.  Will create one.
   [jjtree] File "ASTreset.java" does not exist.  Will create one.
   [jjtree] File "ASTverify.java" does not exist.  Will create one.
   [jjtree] File "ASTgl.java" does not exist.  Will create one.
   [jjtree] File "ASTsm.java" does not exist.  Will create one.
   [jjtree] File "ASTga.java" does not exist.  Will create one.
   [jjtree] File "ASTfb.java" does not exist.  Will create one.
   [jjtree] File "ASTtime.java" does not exist.  Will create one.
   [jjtree] File "ASTpower.java" does not exist.  Will create one.
   [jjtree] File "ASTserver.java" does not exist.  Will create one.
   [jjtree] File "ASTsession.java" does not exist.  Will create one.
   [jjtree] File "ASTlock.java" does not exist.  Will create one.
   [jjtree] File "ASTdescription.java" does not exist.  Will create one.
   [jjtree] File "ASTonoff.java" does not exist.  Will create one.
   [jjtree] File "ASTzeroone.java" does not exist.  Will create one.
   [jjtree] File "ASTdelay.java" does not exist.  Will create one.
   [jjtree] File "ASTtimeout.java" does not exist.  Will create one.
   [jjtree] File "ASTprogmode.java" does not exist.  Will create one.
   [jjtree] File "ASTcv.java" does not exist.  Will create one.
   [jjtree] File "ASTcvbit.java" does not exist.  Will create one.
   [jjtree] File "ASTreg.java" does not exist.  Will create one.
   [jjtree] File "ASTprotocol.java" does not exist.  Will create one.
   [jjtree] File "ASTdrivemode.java" does not exist.  Will create one.
   [jjtree] File "ASTfunctionmode.java" does not exist.  Will create one.
   [jjtree] File "SRCPParserTreeConstants.java" does not exist.  Will create one.
   [jjtree] File "SRCPParserVisitor.java" does not exist.  Will create one.
   [jjtree] File "SRCPParserDefaultVisitor.java" does not exist.  Will create one.
   [jjtree] File "JJTSRCPParserState.java" does not exist.  Will create one.
   [jjtree] Annotated grammar generated successfully in /var/lib/jenkins/workspace/development/alltest/target/generated-sources/jjtree/jmri/jmris/srcp/parser/SRCPParser.jj
    [mkdir] Created dir: /var/lib/jenkins/workspace/development/alltest/target/generated-sources/jjtree/jmri/jmrix/srcp/parser
   [jjtree] Picked up JAVA_TOOL_OPTIONS: -Dfile.encoding=UTF-8
   [jjtree] Java Compiler Compiler Version 7.0.3 (Tree Builder)
   [jjtree] (type "jjtree" with no arguments for help)
   [jjtree] Reading from file /var/lib/jenkins/workspace/development/alltest/java/src/jmri/jmrix/srcp/SRCPClientParser.jjt . . .
   [jjtree] opt:java
   [jjtree] File "Node.java" does not exist.  Will create one.
   [jjtree] File "SimpleNode.java" does not exist.  Will create one.
   [jjtree] File "ASThandshakeresponse.java" does not exist.  Will create one.
   [jjtree] File "ASTtimestamp.java" does not exist.  Will create one.
   [jjtree] File "ASTserviceversion.java" does not exist.  Will create one.
   [jjtree] File "ASTinforesponse.java" does not exist.  Will create one.
   [jjtree] File "ASTinfo.java" does not exist.  Will create one.
   [jjtree] File "ASTerror.java" does not exist.  Will create one.
   [jjtree] File "ASTok.java" does not exist.  Will create one.
   [jjtree] File "ASTcommandresponse.java" does not exist.  Will create one.
   [jjtree] File "ASTbus.java" does not exist.  Will create one.
   [jjtree] File "ASTpower.java" does not exist.  Will create one.
   [jjtree] File "ASTzeroaddress.java" does not exist.  Will create one.
   [jjtree] File "ASTnonzeroaddress.java" does not exist.  Will create one.
   [jjtree] File "ASTport.java" does not exist.  Will create one.
   [jjtree] File "ASTdevicegroup.java" does not exist.  Will create one.
   [jjtree] File "ASTgl.java" does not exist.  Will create one.
   [jjtree] File "ASTsm.java" does not exist.  Will create one.
   [jjtree] File "ASTga.java" does not exist.  Will create one.
   [jjtree] File "ASTfb.java" does not exist.  Will create one.
   [jjtree] File "ASTtime.java" does not exist.  Will create one.
   [jjtree] File "ASTserver.java" does not exist.  Will create one.
   [jjtree] File "ASTsession.java" does not exist.  Will create one.
   [jjtree] File "ASTlock.java" does not exist.  Will create one.
   [jjtree] File "ASTdescription.java" does not exist.  Will create one.
   [jjtree] File "ASTonoff.java" does not exist.  Will create one.
   [jjtree] File "SRCPClientParserTreeConstants.java" does not exist.  Will create one.
   [jjtree] File "SRCPClientParserVisitor.java" does not exist.  Will create one.
   [jjtree] File "SRCPClientParserDefaultVisitor.java" does not exist.  Will create one.
   [jjtree] File "JJTSRCPClientParserState.java" does not exist.  Will create one.
   [jjtree] Annotated grammar generated successfully in /var/lib/jenkins/workspace/development/alltest/target/generated-sources/jjtree/jmri/jmrix/srcp/parser/SRCPClientParser.jj
    [mkdir] Created dir: /var/lib/jenkins/workspace/development/alltest/target/generated-sources/jjtree/jmri/jmris/simpleserver/parser
   [jjtree] Picked up JAVA_TOOL_OPTIONS: -Dfile.encoding=UTF-8
   [jjtree] Java Compiler Compiler Version 7.0.3 (Tree Builder)
   [jjtree] (type "jjtree" with no arguments for help)
   [jjtree] Reading from file /var/lib/jenkins/workspace/development/alltest/java/src/jmri/jmris/simpleserver/JmriServerParser.jjt . . .
   [jjtree] opt:java
   [jjtree] File "Node.java" does not exist.  Will create one.
   [jjtree] File "SimpleNode.java" does not exist.  Will create one.
   [jjtree] File "ASTcommand.java" does not exist.  Will create one.
   [jjtree] File "ASTpowercmd.java" does not exist.  Will create one.
   [jjtree] File "ASTpower.java" does not exist.  Will create one.
   [jjtree] File "ASTonoff.java" does not exist.  Will create one.
   [jjtree] File "ASTturnoutcmd.java" does not exist.  Will create one.
   [jjtree] File "ASTturnout.java" does not exist.  Will create one.
   [jjtree] File "ASTturnoutdevice.java" does not exist.  Will create one.
   [jjtree] File "ASTthrownclosed.java" does not exist.  Will create one.
   [jjtree] File "ASTlightcmd.java" does not exist.  Will create one.
   [jjtree] File "ASTlight.java" does not exist.  Will create one.
   [jjtree] File "ASTlightdevice.java" does not exist.  Will create one.
   [jjtree] File "ASTreportercmd.java" does not exist.  Will create one.
   [jjtree] File "ASTreporter.java" does not exist.  Will create one.
   [jjtree] File "ASTreporterdevice.java" does not exist.  Will create one.
   [jjtree] File "ASTsensorcmd.java" does not exist.  Will create one.
   [jjtree] File "ASTsensor.java" does not exist.  Will create one.
   [jjtree] File "ASTsensordevice.java" does not exist.  Will create one.
   [jjtree] File "ASToperationscmd.java" does not exist.  Will create one.
   [jjtree] File "ASToperations.java" does not exist.  Will create one.
   [jjtree] File "ASTtrains.java" does not exist.  Will create one.
   [jjtree] File "ASTlocations.java" does not exist.  Will create one.
   [jjtree] File "ASTterminate.java" does not exist.  Will create one.
   [jjtree] File "ASTtraincmd.java" does not exist.  Will create one.
   [jjtree] File "ASTattributelist.java" does not exist.  Will create one.
   [jjtree] File "ASTattributename.java" does not exist.  Will create one.
   [jjtree] File "ASTvalue.java" does not exist.  Will create one.
   [jjtree] File "JmriServerParserTreeConstants.java" does not exist.  Will create one.
   [jjtree] File "JmriServerParserVisitor.java" does not exist.  Will create one.
   [jjtree] File "JmriServerParserDefaultVisitor.java" does not exist.  Will create one.
   [jjtree] File "JJTJmriServerParserState.java" does not exist.  Will create one.
   [jjtree] Annotated grammar generated successfully in /var/lib/jenkins/workspace/development/alltest/target/generated-sources/jjtree/jmri/jmris/simpleserver/parser/JmriServerParser.jj

javacc:
    [mkdir] Created dir: /var/lib/jenkins/workspace/development/alltest/target/generated-sources/javacc/jmri/jmris/srcp/parser
   [javacc] Picked up JAVA_TOOL_OPTIONS: -Dfile.encoding=UTF-8
   [javacc] Java Compiler Compiler Version 7.0.3 (Parser Generator)
   [javacc] (type "javacc" with no arguments for help)
   [javacc] Reading from file /var/lib/jenkins/workspace/development/alltest/target/generated-sources/jjtree/jmri/jmris/srcp/parser/SRCPParser.jj . . .
   [javacc] File "TokenMgrError.java" does not exist.  Will create one.
   [javacc] File "ParseException.java" does not exist.  Will create one.
   [javacc] File "Token.java" does not exist.  Will create one.
   [javacc] File "SimpleCharStream.java" does not exist.  Will create one.
   [javacc] Parser generated successfully.
    [mkdir] Created dir: /var/lib/jenkins/workspace/development/alltest/target/generated-sources/javacc/jmri/jmrix/srcp/parser
   [javacc] Picked up JAVA_TOOL_OPTIONS: -Dfile.encoding=UTF-8
   [javacc] Java Compiler Compiler Version 7.0.3 (Parser Generator)
   [javacc] (type "javacc" with no arguments for help)
   [javacc] Reading from file /var/lib/jenkins/workspace/development/alltest/target/generated-sources/jjtree/jmri/jmrix/srcp/parser/SRCPClientParser.jj . . .
   [javacc] File "TokenMgrError.java" does not exist.  Will create one.
   [javacc] File "ParseException.java" does not exist.  Will create one.
   [javacc] File "Token.java" does not exist.  Will create one.
   [javacc] File "SimpleCharStream.java" does not exist.  Will create one.
   [javacc] Parser generated successfully.
    [mkdir] Created dir: /var/lib/jenkins/workspace/development/alltest/target/generated-sources/javacc/jmri/jmris/simpleserver/parser
   [javacc] Picked up JAVA_TOOL_OPTIONS: -Dfile.encoding=UTF-8
   [javacc] Java Compiler Compiler Version 7.0.3 (Parser Generator)
   [javacc] (type "javacc" with no arguments for help)
   [javacc] Reading from file /var/lib/jenkins/workspace/development/alltest/target/generated-sources/jjtree/jmri/jmris/simpleserver/parser/JmriServerParser.jj . . .
   [javacc] File "TokenMgrError.java" does not exist.  Will create one.
   [javacc] File "ParseException.java" does not exist.  Will create one.
   [javacc] File "Token.java" does not exist.  Will create one.
   [javacc] File "SimpleCharStream.java" does not exist.  Will create one.
   [javacc] Parser generated successfully.

update-template-code:
     [copy] Copying 1 file to /var/lib/jenkins/workspace/development/alltest/target/classes

compile-generated-source:
    [javac] Compiling 134 source files to /var/lib/jenkins/workspace/development/alltest/target/classes
    [javac] Picked up JAVA_TOOL_OPTIONS: -Dfile.encoding=UTF-8

compile:
    [javac] Compiling 4833 source files to /var/lib/jenkins/workspace/development/alltest/target/classes
    [javac] Picked up JAVA_TOOL_OPTIONS: -Dfile.encoding=UTF-8

debug:

tests:
    [mkdir] Created dir: /var/lib/jenkins/workspace/development/alltest/target/test-classes
    [javac] Compiling 4435 source files to /var/lib/jenkins/workspace/development/alltest/target/test-classes
    [javac] Picked up JAVA_TOOL_OPTIONS: -Dfile.encoding=UTF-8
    [javac] Note: Some input files use or override a deprecated API.
    [javac] Note: Recompile with -Xlint:deprecation for details.
     [copy] Copying 333 files to /var/lib/jenkins/workspace/development/alltest/target/test-classes

runtime-library-selection:
     [echo] arch.lib.path /var/lib/jenkins/workspace/development/alltest/lib/linux/x86_64:/var/lib/jenkins/workspace/development/alltest/lib/linux

logalltest:
    [mkdir] Created dir: /var/lib/jenkins/workspace/development/alltest/temp
     [java] Picked up JAVA_TOOL_OPTIONS: -Dfile.encoding=UTF-8
     [java] Nov 18, 2020 10:27:55 PM org.junit.platform.launcher.core.LauncherConfigurationParameters fromClasspathResource
     [java] INFO: Loading JUnit Platform configuration parameters from classpath resource [file:/var/lib/jenkins/workspace/development/alltest/target/test-classes/junit-platform.properties].
     [java] Using org.netbeans.jemmy.drivers.DefaultDriverInstaller driver installer
     [java] WARN  - Preventing jmri.jmrit.withrottle.MultiThrottleController@6247a41c adding duplicate PCL [main] jmri.jmrix.AbstractThrottle.addPropertyChangeListener()
     [java] WARN  - Preventing jmri.jmrit.withrottle.MultiThrottleController@78ca55d4 adding duplicate PCL [main] jmri.jmrix.AbstractThrottle.addPropertyChangeListener()
     [java] WARN  - getIconMap failed. family "null" not found in item type "Portal" [AWT-EventQueue-1] jmrit.display.palette.ItemPalette.getIconMap()
     [java] INFO  - DecoderPro version 4.21.3ish+jenkins+20201118T2125Z+R5a61da6f46 starts under Java 1.8.0_181 on Linux amd64 v4.15.0-74-generic at Wed Nov 18 22:28:46 CET 2020 [main] apps.AppsBase.preInit()
     [java] INFO  - No pre-existing config file found, searched for '/var/lib/jenkins/workspace/development/alltest/temp/DecoderProConfig3.xml' [main] apps.AppsBase.setAndLoadPreferenceFile()
     [java] WARN  - Preventing jmri.jmrit.withrottle.MultiThrottleController@5c2c220 adding duplicate PCL [main] jmri.jmrix.AbstractThrottle.addPropertyChangeListener()
     [java] WARN  - Preventing jmri.jmrit.withrottle.MultiThrottleController@5a9502c1 adding duplicate PCL [main] jmri.jmrix.AbstractThrottle.addPropertyChangeListener()
     [java] WARN  - Preventing jmri.jmrit.withrottle.MultiThrottleController@b101bf8 adding duplicate PCL [main] jmri.jmrix.AbstractThrottle.addPropertyChangeListener()
     [java] WARN  - Preventing jmri.jmrit.withrottle.MultiThrottleController@7932c372 adding duplicate PCL [main] jmri.jmrix.AbstractThrottle.addPropertyChangeListener()
     [java] WARN  - Preventing jmri.jmrit.withrottle.MultiThrottleController@38dd24b9 adding duplicate PCL [main] jmri.jmrix.AbstractThrottle.addPropertyChangeListener()
     [java] WARN  - Preventing jmri.jmrit.withrottle.MultiThrottleController@2db246ed adding duplicate PCL [main] jmri.jmrix.AbstractThrottle.addPropertyChangeListener()
     [java] WARN  - Preventing jmri.jmrit.withrottle.MultiThrottleController@6e1433a6 adding duplicate PCL [main] jmri.jmrix.AbstractThrottle.addPropertyChangeListener()
     [java] WARN  - Preventing jmri.jmrit.withrottle.MultiThrottleController@54a88a80 adding duplicate PCL [main] jmri.jmrix.AbstractThrottle.addPropertyChangeListener()
     [java] WARN  - Preventing jmri.jmrit.withrottle.MultiThrottleController@759d3f73 adding duplicate PCL [main] jmri.jmrix.AbstractThrottle.addPropertyChangeListener()
     [java] WARN  - Preventing jmri.jmrit.withrottle.MultiThrottleController@63249b3c adding duplicate PCL [main] jmri.jmrix.AbstractThrottle.addPropertyChangeListener()
     [java] WARN  - Preventing jmri.jmrit.withrottle.MultiThrottleController@1d2845ee adding duplicate PCL [main] jmri.jmrix.AbstractThrottle.addPropertyChangeListener()
     [java] WARN  - Preventing jmri.jmrit.withrottle.MultiThrottleController@59aee3e1 adding duplicate PCL [main] jmri.jmrix.AbstractThrottle.addPropertyChangeListener()
     [java] WARN  - Preventing jmri.jmrit.withrottle.MultiThrottleController@246cdf7b adding duplicate PCL [main] jmri.jmrix.AbstractThrottle.addPropertyChangeListener()
     [java] WARN  - Preventing jmri.jmrit.withrottle.MultiThrottleController@7b34734b adding duplicate PCL [main] jmri.jmrix.AbstractThrottle.addPropertyChangeListener()
     [java] WARN  - Preventing jmri.jmrit.withrottle.MultiThrottleController@5a2afebb adding duplicate PCL [main] jmri.jmrix.AbstractThrottle.addPropertyChangeListener()
     [java] WARN  - Preventing jmri.jmrit.withrottle.MultiThrottleController@2ab0a617 adding duplicate PCL [main] jmri.jmrix.AbstractThrottle.addPropertyChangeListener()
     [java] WARN  - Preventing jmri.jmrit.withrottle.MultiThrottleController@61ad10d0 adding duplicate PCL [main] jmri.jmrix.AbstractThrottle.addPropertyChangeListener()
     [java] WARN  - Preventing jmri.jmrit.withrottle.MultiThrottleController@499ff7d9 adding duplicate PCL [main] jmri.jmrix.AbstractThrottle.addPropertyChangeListener()
     [java] WARN  - Preventing jmri.jmrit.withrottle.MultiThrottleController@b161ea7 adding duplicate PCL [main] jmri.jmrix.AbstractThrottle.addPropertyChangeListener()
     [java] WARN  - Preventing jmri.jmrit.withrottle.MultiThrottleController@5dda5970 adding duplicate PCL [main] jmri.jmrix.AbstractThrottle.addPropertyChangeListener()
     [java] WARN  - Preventing jmri.jmrit.withrottle.MultiThrottleController@6bb5980d adding duplicate PCL [main] jmri.jmrix.AbstractThrottle.addPropertyChangeListener()
     [java] AL lib: (WW) alc_initconfig: Failed to initialize backend "pulse"
     [java] ALSA lib confmisc.c:767:(parse_card) cannot find card '0'
     [java] ALSA lib conf.c:4528:(_snd_config_evaluate) function snd_func_card_driver returned error: No such file or directory
     [java] ALSA lib confmisc.c:392:(snd_func_concat) error evaluating strings
     [java] ALSA lib conf.c:4528:(_snd_config_evaluate) function snd_func_concat returned error: No such file or directory
     [java] ALSA lib confmisc.c:1246:(snd_func_refer) error evaluating name
     [java] ALSA lib conf.c:4528:(_snd_config_evaluate) function snd_func_refer returned error: No such file or directory
     [java] ALSA lib conf.c:5007:(snd_config_expand) Evaluate error: No such file or directory
     [java] ALSA lib pcm.c:2495:(snd_pcm_open_noupdate) Unknown PCM default
     [java] AL lib: (EE) ALCplaybackAlsa_open: Could not open playback device 'default': No such file or directory
     [java] Exception in thread "ClientRxHandler:127.0.0.1" java.lang.NullPointerException: Required nonnull default for jmri.jmrix.loconet.LocoNetSystemConnectionMemo does not exist.
     [java] 	at jmri.InstanceManager.getDefault(InstanceManager.java:206)
     [java] 	at jmri.jmrix.loconet.loconetovertcp.LnTcpServer.lambda$getDefault$1(LnTcpServer.java:62)
     [java] 	at java.util.Optional.orElseGet(Optional.java:267)
     [java] 	at jmri.jmrix.loconet.loconetovertcp.LnTcpServer.getDefault(LnTcpServer.java:61)
     [java] 	at jmri.jmrix.loconet.loconetovertcp.ClientRxHandler.run(ClientRxHandler.java:139)
     [java] /var/lib/jenkins/workspace/development/alltest/temp/temp/Decorations-4-19-4.xml.1.png
     [java] /var/lib/jenkins/workspace/development/alltest/temp/temp/Sidlo-2020-04-Chotebor.xml.1.png
     [java] /var/lib/jenkins/workspace/development/alltest/temp/temp/Sidlo-2020-04-Chotebor.xml.2.png
     [java] /var/lib/jenkins/workspace/development/alltest/temp/temp/Sidlo-2020-04-Chotebor.xml.5.png
     [java] /var/lib/jenkins/workspace/development/alltest/temp/temp/Sidlo-2020-04-Chotebor.xml.6.png
     [java] /var/lib/jenkins/workspace/development/alltest/temp/temp/GeoPanelsAnon.xml.1.png
     [java] /var/lib/jenkins/workspace/development/alltest/temp/temp/GeoPanelsAnon.xml.2.png
     [java] /var/lib/jenkins/workspace/development/alltest/temp/temp/GeoPanelsAnon.xml.3.png
     [java] /var/lib/jenkins/workspace/development/alltest/temp/temp/GeoPanelsAnon.xml.4.png
     [java] /var/lib/jenkins/workspace/development/alltest/temp/temp/ThreeWay-Error-4-19-5.xml.1.png
     [java] /var/lib/jenkins/workspace/development/alltest/temp/temp/LayoutEditorTest-4-19-6.xml.1.png
     [java] /var/lib/jenkins/workspace/development/alltest/temp/temp/OneOfEach-4-19-6.xml.1.png
     [java] /var/lib/jenkins/workspace/development/alltest/temp/temp/Jlang-Panel-4-19-6.xml.1.png
     [java] /var/lib/jenkins/workspace/development/alltest/temp/temp/Jlang-Panel-4-19-6.xml.2.png
     [java] /var/lib/jenkins/workspace/development/alltest/temp/temp/OneSiding-4-19-6.xml.1.png
     [java] /var/lib/jenkins/workspace/development/alltest/temp/temp/Decorations-4-19-6.xml.1.png
     [java] /var/lib/jenkins/workspace/development/alltest/temp/temp/ThreeWay-Error-4-19-6.xml.1.png
     [java] /var/lib/jenkins/workspace/development/alltest/temp/temp/PU-MonP-Signal-Panel-4-19-6.xml.1.png
     [java] /var/lib/jenkins/workspace/development/alltest/temp/temp/DirectionStar.xml.1.png
     [java] /var/lib/jenkins/workspace/development/alltest/temp/temp/LayoutEditorTest-4-19-4.xml.1.png
     [java] /var/lib/jenkins/workspace/development/alltest/temp/temp/DS-Sample-Layout-4-19-6.xml.1.png
     [java] /var/lib/jenkins/workspace/development/alltest/temp/temp/DS-Sample-Layout-4-19-6.xml.2.png
     [java] BlueCove log redirected to log4j
     [java] Native Library bluecove_x64 not available
     [java] AL lib: (EE) ALCplaybackAlsa_open: Could not open playback device 'default': No such file or directory
     [java] AL lib: (EE) ALCplaybackAlsa_open: Could not open playback device 'default': No such file or directory
     [java] 
     [java] jmri.jmrit.jython.SampleScriptTest starts, following output is from script tests
     [java] No Layout Editor window found, script cannot continue!
     [java] Load your Layout Editor panel before running AutoDispatcher!
     [java] 4 turnouts found, 3 changed to CLOSED
     [java] From InstanceManager as MqttTurnoutManager:  jmri.jmrix.mqtt.MqttTurnoutManager@22cad210
     [java] MQTT prefixes updated
     [java] From InstanceManager as MqttTurnoutManager:  jmri.jmrix.mqtt.MqttTurnoutManager@373299d
     [java] ParserReplacement installed
     [java] Starting to set turnouts in UNKNOWN state to CLOSED
     [java] 4 turnouts checked, 1 found in UNKNOWN state and changed to CLOSED
     [java] The <File History> section has been cleared
     [java] Load ManageBlocks v2.4
     [java] Memory variable not found: rAction
     [java] ManageBlocks2 starting
     [java] No Layout Editor panel found
     [java] No Layout Editor panel found
     [java] jmri.jmrit.jython.SampleScriptTest ends, above output was from script tests
     [java] WARN  - requestBoot with null tc, ignored [AWT-EventQueue-1] jmrix.sprog.update.SprogIIUpdateFrame.requestBoot()
     [java] WARN  - getIconMap failed. family "null" not found in item type "Portal" [main] jmrit.display.palette.ItemPalette.getIconMap()
     [java] WARN  - getIconMap failed. family "null" not found in item type "Portal" [main] jmrit.display.palette.ItemPalette.getIconMap()
     [java] WARN  - getIconMap failed. family "null" not found in item type "Portal" [main] jmrit.display.palette.ItemPalette.getIconMap()
     [java] WARN  - getIconMap failed. family "null" not found in item type "Portal" [main] jmrit.display.palette.ItemPalette.getIconMap()
     [java] WARN  - getIconMap failed. family "null" not found in item type "Portal" [main] jmrit.display.palette.ItemPalette.getIconMap()
     [java] WARN  - getIconMap failed. family "null" not found in item type "Portal" [main] jmrit.display.palette.ItemPalette.getIconMap()
     [java] WARN  - getIconMap failed. family "null" not found in item type "Portal" [main] jmrit.display.palette.ItemPalette.getIconMap()
     [java] WARN  - getIconMap failed. family "null" not found in item type "Portal" [main] jmrit.display.palette.ItemPalette.getIconMap()
     [java] WARN  - getIconMap failed. family "null" not found in item type "Portal" [main] jmrit.display.palette.ItemPalette.getIconMap()
     [java] WARN  - getIconMap failed. family "null" not found in item type "Portal" [main] jmrit.display.palette.ItemPalette.getIconMap()
     [java] WARN  - getIconMap failed. family "null" not found in item type "Portal" [main] jmrit.display.palette.ItemPalette.getIconMap()
     [java] WARN  - getIconMap failed. family "null" not found in item type "Portal" [main] jmrit.display.palette.ItemPalette.getIconMap()
     [java] WARN  - getIconMap failed. family "null" not found in item type "Portal" [main] jmrit.display.palette.ItemPalette.getIconMap()
     [java] WARN  - getIconMap failed. family "null" not found in item type "Portal" [main] jmrit.display.palette.ItemPalette.getIconMap()
     [java] WARN  - getIconMap failed. family "null" not found in item type "Portal" [main] jmrit.display.palette.ItemPalette.getIconMap()
     [java] WARN  - getIconMap failed. family "null" not found in item type "Portal" [main] jmrit.display.palette.ItemPalette.getIconMap()
     [java] WARN  - getIconMap failed. family "null" not found in item type "Portal" [main] jmrit.display.palette.ItemPalette.getIconMap()
     [java] WARN  - getIconMap failed. family "null" not found in item type "Portal" [main] jmrit.display.palette.ItemPalette.getIconMap()
     [java] WARN  - getIconMap failed. family "null" not found in item type "Portal" [main] jmrit.display.palette.ItemPalette.getIconMap()
     [java] WARN  - getIconMap failed. family "null" not found in item type "Portal" [AWT-EventQueue-1] jmrit.display.palette.ItemPalette.getIconMap()
     [java] INFO  - Tests running on JMRI 4.21.3ish+jenkins+20201118T2125Z+R5a61da6f46 with Java 1.8.0_181 from en_US, 2007 MB memory of 2667 MB [main] jmri.VersionTest.announceVersions()
     [java] 0
     [java] INFO  - No pre-existing config file found, searched for '/var/lib/jenkins/workspace/development/alltest/temp/DecoderProConfig3.xml' [main] apps.AppsBase.setAndLoadPreferenceFile()
     [java] WARN  - apps.startup.StartupActionFactoryScaffold is deprecated, please remove references to it [main] jmri.util.startup.StartupActionModelUtil.warnOnce()
     [java] java.lang.Exception: traceback
     [java] 	at jmri.util.LoggingUtil.deprecationWarning(LoggingUtil.java:58)
     [java] 	at jmri.util.startup.StartupActionModelUtil.lambda$prepareActionsHashMap$2(StartupActionModelUtil.java:180)
     [java] 	at java.lang.Iterable.forEach(Iterable.java:75)
     [java] 	at jmri.util.startup.StartupActionModelUtil.prepareActionsHashMap(StartupActionModelUtil.java:178)
     [java] 	at jmri.util.startup.StartupActionModelUtil.getActionName(StartupActionModelUtil.java:56)
     [java] 	at jmri.util.startup.StartupActionModelUtil.getActionName(StartupActionModelUtil.java:65)
     [java] 	at jmri.util.startup.StartupActionModelUtilTest.lambda$testNamedBundleIsImplemented$2(StartupActionModelUtilTest.java:58)
     [java] 	at java.util.stream.ForEachOps$ForEachOp$OfRef.accept(ForEachOps.java:184)
     [java] 	at java.util.stream.ReferencePipeline$2$1.accept(ReferencePipeline.java:175)
     [java] 	at java.util.HashMap$KeySpliterator.forEachRemaining(HashMap.java:1553)
     [java] 	at java.util.stream.AbstractPipeline.copyInto(AbstractPipeline.java:481)
     [java] 	at java.util.stream.AbstractPipeline.wrapAndCopyInto(AbstractPipeline.java:471)
     [java] 	at java.util.stream.ForEachOps$ForEachOp.evaluateSequential(ForEachOps.java:151)
     [java] 	at java.util.stream.ForEachOps$ForEachOp$OfRef.evaluateSequential(ForEachOps.java:174)
     [java] 	at java.util.stream.AbstractPipeline.evaluate(AbstractPipeline.java:234)
     [java] 	at java.util.stream.ReferencePipeline.forEach(ReferencePipeline.java:418)
     [java] 	at jmri.util.startup.StartupActionModelUtilTest.testNamedBundleIsImplemented(StartupActionModelUtilTest.java:57)
     [java] 	at jmri.util.startup.StartupActionModelUtilTest.testActionListBundleIsImplemented(StartupActionModelUtilTest.java:42)
     [java] WARN  - apps.startup.StartupActionFactoryScaffold is deprecated, please remove references to it [main] jmri.util.startup.StartupActionModelUtil.warnOnce()
     [java] java.lang.Exception: traceback
     [java] 	at jmri.util.LoggingUtil.deprecationWarning(LoggingUtil.java:58)
     [java] 	at jmri.util.startup.StartupActionModelUtil.lambda$prepareActionsHashMap$2(StartupActionModelUtil.java:180)
     [java] 	at java.lang.Iterable.forEach(Iterable.java:75)
     [java] 	at jmri.util.startup.StartupActionModelUtil.prepareActionsHashMap(StartupActionModelUtil.java:178)
     [java] 	at jmri.util.startup.StartupActionModelUtil.getClasses(StartupActionModelUtil.java:120)
     [java] 	at jmri.util.startup.StartupActionModelUtilTest.testStartupActionFactoryNoErrors(StartupActionModelUtilTest.java:32)
     [java] WARN  - apps.startup.StartupActionFactoryScaffold is deprecated, please remove references to it [main] jmri.util.startup.StartupActionModelUtil.warnOnce()
     [java] java.lang.Exception: traceback
     [java] 	at jmri.util.LoggingUtil.deprecationWarning(LoggingUtil.java:58)
     [java] 	at jmri.util.startup.StartupActionModelUtil.lambda$prepareActionsHashMap$2(StartupActionModelUtil.java:180)
     [java] 	at java.lang.Iterable.forEach(Iterable.java:75)
     [java] 	at jmri.util.startup.StartupActionModelUtil.prepareActionsHashMap(StartupActionModelUtil.java:178)
     [java] 	at jmri.util.startup.StartupActionModelUtil.getActionName(StartupActionModelUtil.java:56)
     [java] 	at jmri.util.startup.StartupActionModelUtil.getActionName(StartupActionModelUtil.java:65)
     [java] 	at jmri.util.startup.StartupActionModelUtilTest.lambda$testNamedBundleIsImplemented$2(StartupActionModelUtilTest.java:58)
     [java] 	at java.util.stream.ForEachOps$ForEachOp$OfRef.accept(ForEachOps.java:184)
     [java] 	at java.util.stream.ReferencePipeline$2$1.accept(ReferencePipeline.java:175)
     [java] 	at java.util.HashMap$KeySpliterator.forEachRemaining(HashMap.java:1553)
     [java] 	at java.util.stream.AbstractPipeline.copyInto(AbstractPipeline.java:481)
     [java] 	at java.util.stream.AbstractPipeline.wrapAndCopyInto(AbstractPipeline.java:471)
     [java] 	at java.util.stream.ForEachOps$ForEachOp.evaluateSequential(ForEachOps.java:151)
     [java] 	at java.util.stream.ForEachOps$ForEachOp$OfRef.evaluateSequential(ForEachOps.java:174)
     [java] 	at java.util.stream.AbstractPipeline.evaluate(AbstractPipeline.java:234)
     [java] 	at java.util.stream.ReferencePipeline.forEach(ReferencePipeline.java:418)
     [java] 	at jmri.util.startup.StartupActionModelUtilTest.testNamedBundleIsImplemented(StartupActionModelUtilTest.java:57)
     [java] 	at jmri.util.startup.StartupActionModelUtilTest.testActionListCoreBundleIsImplemented(StartupActionModelUtilTest.java:51)
     [java] AL lib: (EE) ALCplaybackAlsa_open: Could not open playback device 'default': No such file or directory
     [java] AssertTest: asserts are disabled
     [java] WARN  - sendLocoNetMessage: IOException: java.io.IOException: Read end dead [LocoNet transmit handler] jmrix.loconet.streamport.LnStreamPortPacketizer.run()
     [java] WARN  - sendLocoNetMessage: IOException: java.io.IOException: Read end dead [LocoNet transmit handler] jmrix.loconet.streamport.LnStreamPortPacketizer.run()
     [java] WARN  - Preventing jmri.jmrit.withrottle.MultiThrottleController@30236fa7 adding duplicate PCL [main] jmri.jmrix.AbstractThrottle.addPropertyChangeListener()
     [java] WARN  - Preventing jmri.jmrit.withrottle.MultiThrottleController@29266308 adding duplicate PCL [main] jmri.jmrix.AbstractThrottle.addPropertyChangeListener()
     [java] WARN  - Preventing jmri.jmrit.withrottle.MultiThrottleController@2504d736 adding duplicate PCL [main] jmri.jmrix.AbstractThrottle.addPropertyChangeListener()
     [java] WARN  - Preventing jmri.jmrit.withrottle.MultiThrottleController@5d1425e0 adding duplicate PCL [main] jmri.jmrix.AbstractThrottle.addPropertyChangeListener()
     [java] WARN  - Preventing jmri.jmrit.withrottle.MultiThrottleController@4ca50f26 adding duplicate PCL [main] jmri.jmrix.AbstractThrottle.addPropertyChangeListener()
     [java] WARN  - Preventing jmri.jmrit.withrottle.MultiThrottleController@77b0e7fb adding duplicate PCL [main] jmri.jmrix.AbstractThrottle.addPropertyChangeListener()
     [java] WARN  - Preventing jmri.jmrit.withrottle.MultiThrottleController@6f9fb27 adding duplicate PCL [main] jmri.jmrix.AbstractThrottle.addPropertyChangeListener()
     [java] WARN  - Preventing jmri.jmrit.withrottle.MultiThrottleController@35f8c0c5 adding duplicate PCL [main] jmri.jmrix.AbstractThrottle.addPropertyChangeListener()
     [java] WARN  - Preventing jmri.jmrit.withrottle.MultiThrottleController@3516a69 adding duplicate PCL [main] jmri.jmrix.AbstractThrottle.addPropertyChangeListener()
     [java] WARN  - Preventing jmri.jmrit.withrottle.MultiThrottleController@30f2b4e6 adding duplicate PCL [main] jmri.jmrix.AbstractThrottle.addPropertyChangeListener()
     [java] WARN  - Preventing jmri.jmrit.withrottle.MultiThrottleController@7a9a1156 adding duplicate PCL [main] jmri.jmrix.AbstractThrottle.addPropertyChangeListener()
     [java] WARN  - Preventing jmri.jmrit.withrottle.MultiThrottleController@42094243 adding duplicate PCL [main] jmri.jmrix.AbstractThrottle.addPropertyChangeListener()
     [java] WARN  - Preventing jmri.jmrit.withrottle.MultiThrottleController@4d4e188e adding duplicate PCL [main] jmri.jmrix.AbstractThrottle.addPropertyChangeListener()
     [java] WARN  - Unable to locate icon :resources/icons/throttles/PowerRed24.png: [main] jmri.util.swing.GuiUtilBase.actionFromNode()
     [java] WARN  - apps.startup.StartupActionFactoryScaffold is deprecated, please remove references to it [main] jmri.util.startup.StartupActionModelUtil.warnOnce()
     [java] java.lang.Exception: traceback
     [java] 	at jmri.util.LoggingUtil.deprecationWarning(LoggingUtil.java:58)
     [java] 	at jmri.util.startup.StartupActionModelUtil.lambda$prepareActionsHashMap$2(StartupActionModelUtil.java:180)
     [java] 	at java.lang.Iterable.forEach(Iterable.java:75)
     [java] 	at jmri.util.startup.StartupActionModelUtil.prepareActionsHashMap(StartupActionModelUtil.java:178)
     [java] 	at jmri.util.startup.StartupActionModelUtil.isSystemConnectionAction(StartupActionModelUtil.java:74)
     [java] 	at jmri.util.startup.StartupActionModelUtil.isSystemConnectionAction(StartupActionModelUtil.java:84)
     [java] 	at jmri.util.startup.AbstractActionModel.isSystemConnectionAction(AbstractActionModel.java:77)
     [java] 	at jmri.util.startup.AbstractActionModel.isValid(AbstractActionModel.java:88)
     [java] 	at jmri.util.startup.AbstractActionModelTest.testIsValid(AbstractActionModelTest.java:62)
     [java] WARN  - Stopping train [AA / South-West-CW] in section [South (IY:AUTO:0006)], as next section [West (IY:AUTO:0004)] is not allocated [main] jmri.jmrit.dispatcher.AutoActiveTrain.setNewCurrentSection()
     [java] WARN  - Portal IP0001-0002 needs an OBlock on each side [main] jmrit.beantable.oblock.SignalTableModel.makeList()
     [java] WARN  - File contains a panel with the same name (Layout Editor Test Layout) as an existing panel [main] jmrit.display.layoutEditor.LayoutEditor.<init>()
     [java] testMultiMVoltCanReply: reply(12.9) volt
     [java] AL lib: (EE) ALCplaybackAlsa_open: Could not open playback device 'default': No such file or directory
     [java] AL lib: (EE) ALCplaybackAlsa_open: Could not open playback device 'default': No such file or directory
     [java] AL lib: (EE) ALCplaybackAlsa_open: Could not open playback device 'default': No such file or directory
     [java] AL lib: (EE) ALCplaybackAlsa_open: Could not open playback device 'default': No such file or directory
     [java] WARN  - getIconMap failed. family "null" not found in item type "Portal" [AWT-EventQueue-1] jmrit.display.palette.ItemPalette.getIconMap()
     [java] WARN  - getIconMap failed. family "null" not found in item type "Portal" [AWT-EventQueue-1] jmrit.display.palette.ItemPalette.getIconMap()
     [java] WARN  - getIconMap failed. family "null" not found in item type "Portal" [AWT-EventQueue-1] jmrit.display.palette.ItemPalette.getIconMap()
     [java] INFO  - This INFO message was emitted to test the entire logging chain, please don't remove [main] jmri.util.JUnitAppenderTest.testUnexpectedCheck()
     [java] ERROR - uuid: 399cc071-8baf-4010-b1da-25a7ec0dcd53, meter: ZVCommandStationVoltage, meter: ZVCommandStationVoltage, systemName: ZVCommandStationVoltage [AWT-EventQueue-1] swing.meter.configurexml.MeterFrameManagerXml.load()
     [java] ERROR - uuid: e028e63b-019b-47e2-aab0-c0946dc92204, meter: ZVCommandStationCurrent, meter: ZVCommandStationVoltage, systemName: ZVCommandStationCurrent [AWT-EventQueue-1] swing.meter.configurexml.MeterFrameManagerXml.load()
     [java] ERROR - match failed in LoadAndStoreTest: [main] jmri.configurexml.LoadAndStoreTestBase.checkFile()
     [java] ERROR -     file1:line 36: "  <meterFrames class="jmri.jmrit.swing.meter.configurexml.MeterFrameManagerXml">" [main] jmri.configurexml.LoadAndStoreTestBase.checkFile()
     [java] ERROR -     file2:line 36: "  <filehistory>" [main] jmri.configurexml.LoadAndStoreTestBase.checkFile()
     [java] ERROR -   comparing file1:"java/test/jmri/jmrit/swing/meter/load/TestMetersAndMeterFrames.xml" [main] jmri.configurexml.LoadAndStoreTestBase.checkFile()
     [java] ERROR -          to file2:"/tmp/junit8269873448811031494/temp/TestMetersAndMeterFrames.xml" [main] jmri.configurexml.LoadAndStoreTestBase.checkFile()
     [java] WARN  - Converting route system name IR1 to IO1 [AWT-EventQueue-1] jmri.managers.configurexml.DefaultRouteManagerXml.loadRoutes()
     [java] WARN  - System names for 1 Routes changed; this may have operational impacts. [AWT-EventQueue-1] jmri.managers.configurexml.DefaultRouteManagerXml.loadRoutes()
     [java] WARN  - Converting route system name IR1 to IO1 [AWT-EventQueue-1] jmri.managers.configurexml.DefaultRouteManagerXml.loadRoutes()
     [java] WARN  - System names for 1 Routes changed; this may have operational impacts. [AWT-EventQueue-1] jmri.managers.configurexml.DefaultRouteManagerXml.loadRoutes()
     [java] WARN  - Couldn't find option "Eprom", can't set to "2006 or later" [main] jmri.jmrix.AbstractPortController.setOptionState()
     [java] WARN  - apps.startup.StartupActionFactoryScaffold is deprecated, please remove references to it [main] jmri.util.startup.StartupActionModelUtil.warnOnce()
     [java] java.lang.Exception: traceback
     [java] 	at jmri.util.LoggingUtil.deprecationWarning(LoggingUtil.java:58)
     [java] 	at jmri.util.startup.StartupActionModelUtil.lambda$prepareActionsHashMap$2(StartupActionModelUtil.java:180)
     [java] 	at java.lang.Iterable.forEach(Iterable.java:75)
     [java] 	at jmri.util.startup.StartupActionModelUtil.prepareActionsHashMap(StartupActionModelUtil.java:178)
     [java] 	at jmri.util.startup.StartupActionModelUtil.isSystemConnectionAction(StartupActionModelUtil.java:74)
     [java] 	at jmri.util.startup.StartupActionModelUtil.isSystemConnectionAction(StartupActionModelUtil.java:84)
     [java] 	at jmri.util.startup.AbstractActionModel.isSystemConnectionAction(AbstractActionModel.java:77)
     [java] 	at jmri.util.startup.AbstractActionModel.isValid(AbstractActionModel.java:88)
     [java] 	at apps.startup.AbstractActionModelTest.testIsValid(AbstractActionModelTest.java:62)
     [java] AL lib: (EE) ALCplaybackAlsa_open: Could not open playback device 'default': No such file or directory
     [java] AL lib: (EE) ALCplaybackAlsa_open: Could not open playback device 'default': No such file or directory
     [java] WARN  - apps.startup.StartupActionFactoryScaffold is deprecated, please remove references to it [main] jmri.util.startup.StartupActionModelUtil.warnOnce()
     [java] java.lang.Exception: traceback
     [java] 	at jmri.util.LoggingUtil.deprecationWarning(LoggingUtil.java:58)
     [java] 	at jmri.util.startup.StartupActionModelUtil.lambda$prepareActionsHashMap$2(StartupActionModelUtil.java:180)
     [java] 	at java.lang.Iterable.forEach(Iterable.java:75)
     [java] 	at jmri.util.startup.StartupActionModelUtil.prepareActionsHashMap(StartupActionModelUtil.java:178)
     [java] 	at jmri.util.startup.StartupActionModelUtil.getClasses(StartupActionModelUtil.java:120)
     [java] 	at apps.startup.StartupActionFactoryScaffoldTest.testAction(StartupActionFactoryScaffoldTest.java:21)
     [java] WARN  - shortenStackTrace is deprecated, please remove references to it [main] jmri.util.Log4JUtil.warnOnce()
     [java] java.lang.Exception: traceback
     [java] 	at jmri.util.LoggingUtil.deprecationWarning(LoggingUtil.java:58)
     [java] 	at jmri.util.Log4JUtil.shortenStacktrace(Log4JUtil.java:182)
     [java] 	at jmri.util.Log4JUtilTest.testShortenStacktraceNoArg(Log4JUtilTest.java:131)
     [java] WARN  - shortenStackTrace is deprecated, please remove references to it [main] jmri.util.Log4JUtil.warnOnce()
     [java] java.lang.Exception: traceback
     [java] 	at jmri.util.LoggingUtil.deprecationWarning(LoggingUtil.java:58)
     [java] 	at jmri.util.Log4JUtil.shortenStacktrace(Log4JUtil.java:201)
     [java] 	at jmri.util.Log4JUtilTest.testShortenStacktrace(Log4JUtilTest.java:114)
     [java] WARN  - shortenStackTrace is deprecated, please remove references to it [main] jmri.util.Log4JUtil.warnOnce()
     [java] java.lang.Exception: traceback
     [java] 	at jmri.util.LoggingUtil.deprecationWarning(LoggingUtil.java:58)
     [java] 	at jmri.util.Log4JUtil.shortenStacktrace(Log4JUtil.java:201)
     [java] 	at jmri.util.Log4JUtilTest.testShortenStacktraceTooLong(Log4JUtilTest.java:123)
     [java] AL lib: (EE) ALCplaybackAlsa_open: Could not open playback device 'default': No such file or directory
     [java] AL lib: (EE) ALCplaybackAlsa_open: Could not open playback device 'default': No such file or directory
     [java] AL lib: (EE) ALCplaybackAlsa_open: Could not open playback device 'default': No such file or directory
     [java] AL lib: (EE) ALCplaybackAlsa_open: Could not open playback device 'default': No such file or directory
     [java] AL lib: (EE) ALCplaybackAlsa_open: Could not open playback device 'default': No such file or directory
     [java] AL lib: (EE) ALCplaybackAlsa_open: Could not open playback device 'default': No such file or directory
     [java] AL lib: (EE) ALCplaybackAlsa_open: Could not open playback device 'default': No such file or directory
     [java] AL lib: (EE) ALCplaybackAlsa_open: Could not open playback device 'default': No such file or directory
     [java] AL lib: (EE) ALCplaybackAlsa_open: Could not open playback device 'default': No such file or directory
     [java] AL lib: (EE) ALCplaybackAlsa_open: Could not open playback device 'default': No such file or directory
     [java] AL lib: (EE) ALCplaybackAlsa_open: Could not open playback device 'default': No such file or directory
     [java] AL lib: (EE) ALCplaybackAlsa_open: Could not open playback device 'default': No such file or directory
     [java] AL lib: (EE) ALCplaybackAlsa_open: Could not open playback device 'default': No such file or directory
     [java] AL lib: (EE) ALCplaybackAlsa_open: Could not open playback device 'default': No such file or directory
     [java] AL lib: (EE) ALCplaybackAlsa_open: Could not open playback device 'default': No such file or directory
     [java] Should be the same:
     [java] ERROR - Unable to close client: null [main] jmri.jmrix.ipocs.IpocsClientHandler.completed()
     [java] ERROR - Error closing connection [main] jmri.jmrix.ipocs.IpocsClientHandler.failed()
     [java] java.io.IOException
     [java] 	at jmri.jmrix.ipocs.IpocsClientHandler.failed(IpocsClientHandler.java:94)
     [java] 	at jmri.jmrix.ipocs.IpocsClientHandlerTest.failedTest(IpocsClientHandlerTest.java:114)
     [java] 	at sun.reflect.NativeMethodAccessorImpl.invoke0(Native Method)
     [java] 	at sun.reflect.NativeMethodAccessorImpl.invoke(NativeMethodAccessorImpl.java:62)
     [java] 	at sun.reflect.DelegatingMethodAccessorImpl.invoke(DelegatingMethodAccessorImpl.java:43)
     [java] 	at java.lang.reflect.Method.invoke(Method.java:498)
     [java] 	at org.junit.runners.model.FrameworkMethod$1.runReflectiveCall(FrameworkMethod.java:59)
     [java] 	at org.junit.internal.runners.model.ReflectiveCallable.run(ReflectiveCallable.java:12)
     [java] 	at org.junit.runners.model.FrameworkMethod.invokeExplosively(FrameworkMethod.java:56)
     [java] 	at org.junit.internal.runners.statements.InvokeMethod.evaluate(InvokeMethod.java:17)
     [java] 	at org.junit.runners.ParentRunner$3.evaluate(ParentRunner.java:306)
     [java] 	at org.junit.runners.BlockJUnit4ClassRunner$1.evaluate(BlockJUnit4ClassRunner.java:100)
     [java] 	at org.junit.runners.ParentRunner.runLeaf(ParentRunner.java:366)
     [java] 	at org.junit.runners.BlockJUnit4ClassRunner.runChild(BlockJUnit4ClassRunner.java:103)
     [java] 	at org.junit.runners.BlockJUnit4ClassRunner.runChild(BlockJUnit4ClassRunner.java:63)
     [java] 	at org.junit.runners.ParentRunner$4.run(ParentRunner.java:331)
     [java] 	at org.junit.runners.ParentRunner$1.schedule(ParentRunner.java:79)
     [java] 	at org.junit.runners.ParentRunner.runChildren(ParentRunner.java:329)
     [java] 	at org.junit.runners.ParentRunner.access$100(ParentRunner.java:66)
     [java] 	at org.junit.runners.ParentRunner$2.evaluate(ParentRunner.java:293)
     [java] 	at org.junit.runners.ParentRunner$3.evaluate(ParentRunner.java:306)
     [java] 	at org.junit.runners.ParentRunner.run(ParentRunner.java:413)
     [java] 	at org.junit.runner.JUnitCore.run(JUnitCore.java:137)
     [java] 	at org.junit.runner.JUnitCore.run(JUnitCore.java:115)
     [java] 	at org.junit.vintage.engine.execution.RunnerExecutor.execute(RunnerExecutor.java:43)
     [java] 	at java.util.stream.ForEachOps$ForEachOp$OfRef.accept(ForEachOps.java:184)
     [java] 	at java.util.stream.ReferencePipeline$3$1.accept(ReferencePipeline.java:193)
     [java] 	at java.util.Iterator.forEachRemaining(Iterator.java:116)
     [java] 	at java.util.Spliterators$IteratorSpliterator.forEachRemaining(Spliterators.java:1801)
     [java] 	at java.util.stream.AbstractPipeline.copyInto(AbstractPipeline.java:481)
     [java] 	at java.util.stream.AbstractPipeline.wrapAndCopyInto(AbstractPipeline.java:471)
     [java] 	at java.util.stream.ForEachOps$ForEachOp.evaluateSequential(ForEachOps.java:151)
     [java] 	at java.util.stream.ForEachOps$ForEachOp$OfRef.evaluateSequential(ForEachOps.java:174)
     [java] 	at java.util.stream.AbstractPipeline.evaluate(AbstractPipeline.java:234)
     [java] 	at java.util.stream.ReferencePipeline.forEach(ReferencePipeline.java:418)
     [java] 	at org.junit.vintage.engine.VintageTestEngine.executeAllChildren(VintageTestEngine.java:82)
     [java] 	at org.junit.vintage.engine.VintageTestEngine.execute(VintageTestEngine.java:73)
     [java] 	at org.junit.platform.launcher.core.DefaultLauncher.execute(DefaultLauncher.java:248)
     [java] 	at org.junit.platform.launcher.core.DefaultLauncher.lambda$execute$5(DefaultLauncher.java:211)
     [java] 	at org.junit.platform.launcher.core.DefaultLauncher.withInterceptedStreams(DefaultLauncher.java:226)
     [java] 	at org.junit.platform.launcher.core.DefaultLauncher.execute(DefaultLauncher.java:199)
     [java] 	at org.junit.platform.launcher.core.DefaultLauncher.execute(DefaultLauncher.java:132)
     [java] 	at org.junit.platform.console.tasks.ConsoleTestExecutor.executeTests(ConsoleTestExecutor.java:66)
     [java] 	at org.junit.platform.console.tasks.ConsoleTestExecutor.lambda$execute$0(ConsoleTestExecutor.java:58)
     [java] 	at org.junit.platform.console.tasks.CustomContextClassLoaderExecutor.invoke(CustomContextClassLoaderExecutor.java:33)
     [java] 	at org.junit.platform.console.tasks.ConsoleTestExecutor.execute(ConsoleTestExecutor.java:58)
     [java] 	at org.junit.platform.console.ConsoleLauncher.executeTests(ConsoleLauncher.java:95)
     [java] 	at org.junit.platform.console.ConsoleLauncher.execute(ConsoleLauncher.java:73)
     [java] 	at org.junit.platform.console.ConsoleLauncher.execute(ConsoleLauncher.java:50)
     [java] 	at org.junit.platform.console.ConsoleLauncher.execute(ConsoleLauncher.java:43)
     [java] 	at org.junit.platform.console.ConsoleLauncher.main(ConsoleLauncher.java:37)
     [java] Exception in thread "Thread-12652" org.netbeans.jemmy.TimeoutExpiredException: Frame with title "Copy Conditional IX102" (WindowWaiter.WaitWindowTimeout)
     [java] 	at org.netbeans.jemmy.Waiter.waitAction(Waiter.java:210)
     [java] 	at org.netbeans.jemmy.WindowWaiter.waitWindow(WindowWaiter.java:534)
     [java] 	at org.netbeans.jemmy.WindowWaiter.waitWindow(WindowWaiter.java:217)
     [java] 	at org.netbeans.jemmy.FrameWaiter.waitFrame(FrameWaiter.java:233)
     [java] 	at org.netbeans.jemmy.operators.FrameOperator.waitFrame(FrameOperator.java:512)
     [java] 	at org.netbeans.jemmy.operators.JFrameOperator.<init>(JFrameOperator.java:70)
     [java] 	at org.netbeans.jemmy.operators.JFrameOperator.<init>(JFrameOperator.java:108)
     [java] 	at org.netbeans.jemmy.operators.JFrameOperator.<init>(JFrameOperator.java:125)
     [java] 	at org.netbeans.jemmy.operators.JFrameOperator.<init>(JFrameOperator.java:140)
     [java] 	at jmri.jmrit.conditional.ConditionalListCopyTest.lambda$CopyConditionalFullEditTest$1(ConditionalListCopyTest.java:88)
     [java] 	at java.lang.Thread.run(Thread.java:748)
     [java] Exception in thread "Thread-12655" org.netbeans.jemmy.TimeoutExpiredException: Frame with title "Copy Conditional IX102" (WindowWaiter.WaitWindowTimeout)
     [java] 	at org.netbeans.jemmy.Waiter.waitAction(Waiter.java:210)
     [java] 	at org.netbeans.jemmy.WindowWaiter.waitWindow(WindowWaiter.java:534)
     [java] 	at org.netbeans.jemmy.WindowWaiter.waitWindow(WindowWaiter.java:217)
     [java] 	at org.netbeans.jemmy.FrameWaiter.waitFrame(FrameWaiter.java:233)
     [java] 	at org.netbeans.jemmy.operators.FrameOperator.waitFrame(FrameOperator.java:512)
     [java] 	at org.netbeans.jemmy.operators.JFrameOperator.<init>(JFrameOperator.java:70)
     [java] 	at org.netbeans.jemmy.operators.JFrameOperator.<init>(JFrameOperator.java:108)
     [java] 	at org.netbeans.jemmy.operators.JFrameOperator.<init>(JFrameOperator.java:125)
     [java] 	at org.netbeans.jemmy.operators.JFrameOperator.<init>(JFrameOperator.java:140)
     [java] 	at jmri.jmrit.conditional.ConditionalListCopyTest.lambda$CopyConditionalChangeNameTest$0(ConditionalListCopyTest.java:57)
     [java] 	at java.lang.Thread.run(Thread.java:748)
     [java] ERROR - Unable to accept socket [main] jmri.jmrix.ipocs.IpocsSocketAcceptor.failed()
     [java] ERROR - Unknown turnout order state [main] jmri.jmrix.ipocs.IpocsTurnout.forwardCommandChangeToLayout()
     [java] ERROR - Tag RFID 3 not found [Time-limited test] jmrit.operations.rollingstock.RollingStock.setRfid()
     [java] ERROR - Tag RFID 3 not found [Test Import Cars] jmrit.operations.rollingstock.RollingStock.setRfid()
     [java] 
     [java] 0 Scenarios
     [java] 0 Steps
     [java] 0m6.352s
     [java] 
     [java] 
     [java] ERROR - Unknown light order state [main] jmri.jmrix.ipocs.IpocsLight.doNewState()
     [java] ERROR - Unknown light order state [main] jmri.jmrix.ipocs.IpocsLight.doNewState()
     [java] ERROR - Unknown light order state [main] jmri.jmrix.ipocs.IpocsLight.doNewState()
     [java] ERROR - No packet found for identifier 32 [main] ipocs.protocol.packets.Packet.parse()
     [java] Value: 3.30
     [java] Value: 3.30
     [java] INFO  - Starting with profile LocoNet_Simulator.3f1121a3 [main] apps.Apps.<init>()
     [java] WARN  - apps.startup.StartupActionFactoryScaffold is deprecated, please remove references to it [main] jmri.util.startup.StartupActionModelUtil.warnOnce()
     [java] java.lang.Exception: traceback
     [java] 	at jmri.util.LoggingUtil.deprecationWarning(LoggingUtil.java:58)
     [java] 	at jmri.util.startup.StartupActionModelUtil.lambda$prepareActionsHashMap$2(StartupActionModelUtil.java:180)
     [java] 	at java.lang.Iterable.forEach(Iterable.java:75)
     [java] 	at jmri.util.startup.StartupActionModelUtil.prepareActionsHashMap(StartupActionModelUtil.java:178)
     [java] 	at jmri.util.startup.StartupActionModelUtil.getOverride(StartupActionModelUtil.java:209)
     [java] 	at jmri.util.startup.StartupActionsManager.initialize(StartupActionsManager.java:88)
     [java] 	at jmri.implementation.JmriConfigurationManager.initializeProvider(JmriConfigurationManager.java:456)
     [java] 	at jmri.implementation.JmriConfigurationManager.lambda$load$2(JmriConfigurationManager.java:216)
     [java] 	at java.util.stream.ForEachOps$ForEachOp$OfRef.accept(ForEachOps.java:184)
     [java] 	at java.util.stream.SortedOps$SizedRefSortingSink.end(SortedOps.java:352)
     [java] 	at java.util.stream.AbstractPipeline.copyInto(AbstractPipeline.java:482)
     [java] 	at java.util.stream.AbstractPipeline.wrapAndCopyInto(AbstractPipeline.java:471)
     [java] 	at java.util.stream.ForEachOps$ForEachOp.evaluateSequential(ForEachOps.java:151)
     [java] 	at java.util.stream.ForEachOps$ForEachOp$OfRef.evaluateSequential(ForEachOps.java:174)
     [java] 	at java.util.stream.AbstractPipeline.evaluate(AbstractPipeline.java:234)
     [java] 	at java.util.stream.ReferencePipeline.forEachOrdered(ReferencePipeline.java:423)
     [java] 	at jmri.implementation.JmriConfigurationManager.load(JmriConfigurationManager.java:216)
     [java] 	at jmri.implementation.JmriConfigurationManager.load(JmriConfigurationManager.java:196)
     [java] 	at apps.Apps.<init>(Apps.java:202)
     [java] 	at apps.DecoderPro.DecoderPro.<init>(DecoderPro.java:45)
     [java] 	at apps.DecoderPro.DecoderPro.main(DecoderPro.java:149)
     [java] 	at sun.reflect.NativeMethodAccessorImpl.invoke0(Native Method)
     [java] 	at sun.reflect.NativeMethodAccessorImpl.invoke(NativeMethodAccessorImpl.java:62)
     [java] 	at sun.reflect.DelegatingMethodAccessorImpl.invoke(DelegatingMethodAccessorImpl.java:43)
     [java] 	at java.lang.reflect.Method.invoke(Method.java:498)
     [java] 	at apps.ApplicationTestAcceptanceSteps.lambda$new$2(ApplicationTestAcceptanceSteps.java:60)
     [java] INFO  - Starting with profile EasyDcc__Simulator.3f1121a3 [main] apps.Apps.<init>()
     [java] INFO  - Starting with profile TMCC_Simulator.3f0b414a [main] apps.Apps.<init>()
     [java] INFO  - Starting with profile Prevent_Init_Loop.3f01644a [main] apps.Apps.<init>()
     [java] INFO  - Starting with profile Sprog_Simulator.3d40b3b8 [main] apps.Apps.<init>()
     [java] INFO  - Starting with profile LocoNet_Simulator.3f1121a3 [main] apps.gui3.Apps3.configureProfile()
     [java] INFO  - Starting with profile EasyDcc__Simulator.3f1121a3 [main] apps.gui3.Apps3.configureProfile()
     [java] INFO  - Starting with profile TMCC_Simulator.3f0b414a [main] apps.gui3.Apps3.configureProfile()
     [java] INFO  - Starting with profile Prevent_Init_Loop.3f01644a [main] apps.gui3.Apps3.configureProfile()
     [java] INFO  - Starting with profile Grapevine_Simulator.3f339028 [main] apps.gui3.Apps3.configureProfile()
     [java] INFO  - Starting with profile Sprog_Simulator.3d40b3b8 [main] apps.gui3.Apps3.configureProfile()
     [java] INFO  - Starting with profile LocoNet_Simulator.3f1121a3 [main] apps.Apps.<init>()
     [java] INFO  - Starting with profile EasyDcc__Simulator.3f1121a3 [main] apps.Apps.<init>()
     [java] INFO  - Starting with profile TMCC_Simulator.3f0b414a [main] apps.Apps.<init>()
     [java] INFO  - Starting with profile Prevent_Init_Loop.3f01644a [main] apps.Apps.<init>()
     [java] INFO  - Starting with profile Grapevine_Simulator.3f339028 [main] apps.Apps.<init>()
     [java] INFO  - Starting with profile Sprog_Simulator.3d40b3b8 [main] apps.Apps.<init>()
     [java] INFO  - Starting with profile LocoNet_Simulator.3f1121a3 [main] apps.Apps.<init>()
     [java] INFO  - Starting with profile EasyDcc__Simulator.3f1121a3 [main] apps.Apps.<init>()
     [java] INFO  - Starting with profile TMCC_Simulator.3f0b414a [main] apps.Apps.<init>()
     [java] INFO  - Starting with profile Prevent_Init_Loop.3f01644a [main] apps.Apps.<init>()
     [java] INFO  - Starting with profile Grapevine_Simulator.3f339028 [main] apps.Apps.<init>()
     [java] INFO  - Starting with profile Sprog_Simulator.3d40b3b8 [main] apps.Apps.<init>()
     [java] INFO  - Starting with profile LocoNet_Simulator.3f1121a3 [main] apps.AppsBase.configureProfile()
     [java] INFO  - Starting with profile EasyDcc__Simulator.3f1121a3 [main] apps.AppsBase.configureProfile()
     [java] ......................................................................................................................
     [java] 30 Scenarios (30 passed)
     [java] 118 Steps (118 passed)
     [java] 3m38.519s
     [java] 
     [java] 
     [java] 
     [java] Thanks for using JUnit! Support its development at https://junit.org/sponsoring
     [java] 
     [java] 
     [java] Failures (2):
     [java]   JUnit Jupiter:LoadAndStoreTest:loadAndStoreTest(File, boolean):1: java/test/jmri/jmrit/swing/meter/load/TestMetersAndMeterFrames.xml (pass=true)
     [java]     MethodSource [className = 'jmri.jmrit.swing.meter.LoadAndStoreTest', methodName = 'loadAndStoreTest', methodParameterTypes = 'java.io.File, boolean']
     [java]     => org.junit.ComparisonFailure: expected:<  <[meterFrames class="jmri.jmrit.swing.meter.configurexml.MeterFrameManagerXml"]>> but was:<  <[filehistory]>>
     [java]        org.junit.Assert.assertEquals(Assert.java:117)
     [java]        org.junit.Assert.assertEquals(Assert.java:146)
     [java]        jmri.configurexml.LoadAndStoreTestBase.checkFile(LoadAndStoreTestBase.java:232)
     [java]        jmri.configurexml.LoadAndStoreTestBase.loadLoadStoreFileCheck(LoadAndStoreTestBase.java:327)
     [java]        jmri.jmrit.swing.meter.LoadAndStoreTest.loadAndStoreTest(LoadAndStoreTest.java:45)
     [java]        [...]
     [java]        Suppressed: java.lang.AssertionError: Unexpected ERROR or higher messages emitted:          to file2:"/tmp/junit8269873448811031494/temp/TestMetersAndMeterFrames.xml"
     [java]          org.junit.Assert.fail(Assert.java:89)
     [java]          org.junit.Assert.assertTrue(Assert.java:42)
     [java]          org.junit.Assert.assertFalse(Assert.java:65)
     [java]          jmri.util.JUnitUtil.tearDown(JUnitUtil.java:339)
     [java]          jmri.configurexml.LoadAndStoreTestBase.tearDown(LoadAndStoreTestBase.java:376)
     [java]          [...]
     [java]   JUnit Jupiter:DecoderPro3Test:testCtor()
     [java]     MethodSource [className = 'apps.gui3.dp3.DecoderPro3Test', methodName = 'testCtor', methodParameterTypes = '']
     [java]     => java.lang.AssertionError: Unable to find frame "DecoderPro Wizard" to dispose.
     [java]        org.junit.Assert.fail(Assert.java:89)
     [java]        jmri.util.JUnitUtil.disposeFrame(JUnitUtil.java:1289)
     [java]        apps.gui3.dp3.DecoderPro3Test.testCtor(DecoderPro3Test.java:56)
     [java]        sun.reflect.NativeMethodAccessorImpl.invoke0(Native Method)
     [java]        sun.reflect.NativeMethodAccessorImpl.invoke(NativeMethodAccessorImpl.java:62)
     [java]        sun.reflect.DelegatingMethodAccessorImpl.invoke(DelegatingMethodAccessorImpl.java:43)
     [java]        java.lang.reflect.Method.invoke(Method.java:498)
     [java]        org.junit.platform.commons.util.ReflectionUtils.invokeMethod(ReflectionUtils.java:686)
     [java]        org.junit.jupiter.engine.execution.MethodInvocation.proceed(MethodInvocation.java:60)
     [java]        org.junit.jupiter.engine.execution.InvocationInterceptorChain$ValidatingInvocation.proceed(InvocationInterceptorChain.java:131)
     [java]        [...]
     [java] 
     [java] Test run finished after 2797122 ms
     [java] [      4288 containers found      ]
     [java] [         7 containers skipped    ]
     [java] [      4281 containers started    ]
     [java] [         0 containers aborted    ]
     [java] [      4281 containers successful ]
     [java] [         0 containers failed     ]
     [java] [     28282 tests found           ]
     [java] [       298 tests skipped         ]
     [java] [     27984 tests started         ]
     [java] [       667 tests aborted         ]
     [java] [     27315 tests successful      ]
     [java] [         2 tests failed          ]
     [java] 

BUILD FAILED
/var/lib/jenkins/workspace/development/alltest/build.xml:1556: Java returned: 1

Total time: 49 minutes 15 seconds
Build step 'Invoke Ant' marked build as failure
Xvfb stopping
[ConsoleLogToWorkspace] Writing console log to workspace file console.log started
[ConsoleLogToWorkspace] Wrote console log to workspace file console.log successfully
Recording test results
Finished: FAILURE